Target
Adenosine receptor A1
Ligand
BDBM42467
Substrate
Meas. Tech.
ChEBML_29144
Ki
4.6±n/a nM
Citation
 Bridges, AJMoos, WHSzotek, DLTrivedi, BKBristol, JAHeffner, TGBruns, RFDowns, DA N6-(2,2-diphenylethyl)adenosine, a novel adenosine receptor agonist with antipsychotic-like activity. J Med Chem 30:1709-11 (1987)  
Target
Name:
Adenosine receptor A1
Synonyms:
AA1R_RAT ADENOSINE A1 high Adenosine A1 receptor (A1) Adenosine receptors A1 | Adora1
Type:
Protein
Mol. Mass.:
36704.13
Organism:
Rattus norvegicus (rat)
Description:
Residue:
326
  
Inhibitor
Name:
BDBM42467
Synonyms:
(2R,3R,4S,5R)-2-(6-anilino-9-purinyl)-5-(hydroxymethyl)oxolane-3,4-diol (2R,3R,4S,5R)-2-(6-anilinopurin-9-yl)-5-methylol-tetrahydrofuran-3,4-diol MLS000069355 N6-PHENYLADENOSINE cid_101430
Type:
Small organic molecule
Emp. Form.:
C16H17N5O4
Mol. Mass.:
343.3373
SMILES:
OC[C@H]1O[C@H]([C@H](O)[C@@H]1O)n1cnc2c(Nc3ccccc3)ncnc12
: