Target
Delta-type opioid receptor
Ligand
BDBM50019092
Substrate
Meas. Tech.
ChEBML_146779
Kd
4000±n/a nM
Citation
 Lawson, JACheng, ADeGraw, JFrenking, GUyeno, EToll, LLoew, GH Effects of addition of a 2-methyl group to ethyl nipecotates (beta-meperidines) on receptor affinities and opiate agonist/antagonist activities. J Med Chem 31:2015-21 (1988)  
Target
Name:
Delta-type opioid receptor
Synonyms:
Cytochrome P450 3A4 Delta opioid receptor Delta-type opioid receptor (DOR) OPRD_RAT Opioid receptor Opioid receptors; mu & delta Ror-a | Voltage-gated potassium channel
Type:
G Protein-Coupled Receptor (GPCR)
Mol. Mass.:
40465.04
Organism:
Rattus norvegicus (rat)
Description:
Competition binding assays were using CHO-K1 cell membranes expressing the opioid receptor.
Residue:
372
  
Inhibitor
Name:
BDBM50019092
Synonyms:
3-(3-Hydroxy-phenyl)-1-methyl-piperidine-3-carboxylic acid ethyl ester | CHEMBL59989
Type:
Small organic molecule
Emp. Form.:
C15H21NO3
Mol. Mass.:
263.3321
SMILES:
CCOC(=O)[C@@]1(CCCN(C)C1)c1cccc(O)c1
: