Target
Adenosylhomocysteinase
Ligand
BDBM50023889
Substrate
Meas. Tech.
ChEBML_197203
Ki
90±n/a nM
Citation
 Borcherding, DRNarayanan, SHasobe, MMcKee, JGKeller, BTBorchardt, RT Potential inhibitors of S-adenosylmethionine-dependent methyltransferases. 11. Molecular dissections of neplanocin A as potential inhibitors of S-adenosylhomocysteine hydrolase. J Med Chem 31:1729-38 (1988)  
Target
Name:
Adenosylhomocysteinase
Synonyms:
AHCY SAHH | SAHH_HUMAN
Type:
PROTEIN
Mol. Mass.:
47714.06
Organism:
Homo sapiens (Human)
Description:
ChEMBL_1507791
Residue:
432
  
Inhibitor
Name:
BDBM50023889
Synonyms:
5-(4-Amino-imidazo[4,5-c]pyridin-1-yl)-pent-3-ene-1,2-diol | CHEMBL296880
Type:
Small organic molecule
Emp. Form.:
C11H14N4O2
Mol. Mass.:
234.2545
SMILES:
Nc1nccc2n(C\C=C/[C@@H](O)CO)cnc12
: