Target
Adenosine receptor A1
Ligand
BDBM50367846
Substrate
Meas. Tech.
ChEBML_29460
Ki
0.420000±n/a nM
Citation
 Trivedi, BKBridges, AJPatt, WCPriebe, SRBruns, RF N6-bicycloalkyladenosines with unusually high potency and selectivity for the adenosine A1 receptor. J Med Chem 32:8-11 (1989)  
Target
Name:
Adenosine receptor A1
Synonyms:
AA1R_RAT ADENOSINE A1 high Adenosine A1 receptor (A1) Adenosine receptors A1 | Adora1
Type:
Protein
Mol. Mass.:
36704.13
Organism:
Rattus norvegicus (rat)
Description:
Residue:
326
  
Inhibitor
Name:
BDBM50367846
Synonyms:
CHEMBL3038256
Type:
Small organic molecule
Emp. Form.:
C17H22ClN5O3
Mol. Mass.:
379.841
SMILES:
[H][C@]12CCC(C1)C(C2)Nc1ncnc2n(cnc12)[C@@H]1O[C@H](CCl)[C@@H](O)[C@H]1O
: