Target
Angiotensin-converting enzyme
Ligand
BDBM50020383
Substrate
Meas. Tech.
ChEBML_34768
IC50
1.6±n/a nM
Citation
 Hayashi, KNunami, KKato, JYoneda, NKubo, MOchiai, TIshida, R Studies on angiotensin converting enzyme inhibitors. 4. Synthesis and angiotensin converting enzyme inhibitory activities of 3-acyl-1-alkyl-2-oxoimidazolidine-4-carboxylic acid derivatives. J Med Chem 32:289-97 (1989)  
Target
Name:
Angiotensin-converting enzyme
Synonyms:
ACE Angiotensin converting enzyme (ACE) Angiotensin-converting enzyme, soluble form CD_antigen=CD143 DCP1 Kininase II
Type:
Enzyme
Mol. Mass.:
149709.01
Organism:
Homo sapiens (Human)
Description:
Residue:
1306
  
Inhibitor
Name:
BDBM50020383
Synonyms:
3-[2-(1-Carboxy-nonylamino)-propionyl]-1-methyl-2-oxo-imidazolidine-4-carboxylic acid | CHEMBL101360
Type:
Small organic molecule
Emp. Form.:
C18H31N3O6
Mol. Mass.:
385.4552
SMILES:
CCCCCCCC[C@H](N[C@@H](C)C(=O)N1[C@@H](CN(C)C1=O)C(O)=O)C(O)=O
: