Target
Mu-type opioid receptor
Ligand
BDBM50017233
Substrate
Meas. Tech.
ChEMBL_146243 (CHEMBL753435)
IC50
0.600000±n/a nM
Citation
 Fujimoto, RABoxer, JJackson, RHSimke, JPNeale, RFSnowhill, EWBarbaz, BJWilliams, MSills, MA Synthesis, opioid receptor binding profile, and antinociceptive activity of 1-azaspiro[4.5]decan-10-yl amides. J Med Chem 32:1259-65 (1989)  
Target
Name:
Mu-type opioid receptor
Synonyms:
M-OR-1 Mu opioid receptor OPIATE Mu OPRM_CAVPO
Type:
Enzyme Catalytic Domain
Mol. Mass.:
11165.58
Organism:
GUINEA PIG
Description:
P97266
Residue:
98
  
Inhibitor
Name:
BDBM50017233
Synonyms:
CHEMBL592 LEVORPHANOL
Type:
Small organic molecule
Emp. Form.:
C17H23NO
Mol. Mass.:
257.3706
SMILES:
CN1CC[C@]23CCCC[C@H]2[C@H]1Cc1ccc(O)cc31
: