Target
5-hydroxytryptamine receptor 1B
Ligand
BDBM50014154
Substrate
Meas. Tech.
ChEBML_1837
Ki
>1000±n/a nM
Citation
 Rosen, TNagel, AARizzi, JPIves, JLDaffeh, JBGanong, AHGuarino, KHeym, JMcLean, SNowakowski, JT Thiazole as a carbonyl bioisostere. A novel class of highly potent and selective 5-HT3 receptor antagonists. J Med Chem 33:2715-20 (1990)  
Target
Name:
5-hydroxytryptamine receptor 1B
Synonyms:
5-HT-1B 5-HT1B 5HT1B_HUMAN HTR1DB Serotonin (5-HT) receptor Serotonin Receptor 1B
Type:
G Protein-Coupled Receptor (GPCR)
Mol. Mass.:
43579.17
Organism:
Homo sapiens (Human)
Description:
Receptor binding assays were performed using human clone stably expressed in CHO cells
Residue:
390
  
Inhibitor
Name:
BDBM50014154
Synonyms:
2-(5-Methyl-1H-imidazol-4-ylmethyl)-4-phenyl-thiazole | CHEMBL38465
Type:
Small organic molecule
Emp. Form.:
C14H13N3S
Mol. Mass.:
255.338
SMILES:
Cc1nc[nH]c1Cc1nc(cs1)-c1ccccc1
: