Target
Mu-type opioid receptor
Ligand
BDBM50014154
Substrate
Meas. Tech.
ChEBML_149455
Ki
>1000±n/a nM
Citation
 Rosen, TNagel, AARizzi, JPIves, JLDaffeh, JBGanong, AHGuarino, KHeym, JMcLean, SNowakowski, JT Thiazole as a carbonyl bioisostere. A novel class of highly potent and selective 5-HT3 receptor antagonists. J Med Chem 33:2715-20 (1990)  
Target
Name:
Mu-type opioid receptor
Synonyms:
M-OR-1 MOR-1 MUOR1 Mu opiate receptor OPRM1 hMOP | mu-type opioid receptor isoform MOR-1
Type:
G Protein-Coupled Receptor (GPCR)
Mol. Mass.:
44789.51
Organism:
Homo sapiens (Human)
Description:
P35372
Residue:
400
  
Inhibitor
Name:
BDBM50014154
Synonyms:
2-(5-Methyl-1H-imidazol-4-ylmethyl)-4-phenyl-thiazole | CHEMBL38465
Type:
Small organic molecule
Emp. Form.:
C14H13N3S
Mol. Mass.:
255.338
SMILES:
Cc1nc[nH]c1Cc1nc(cs1)-c1ccccc1
: