Target
Beta-1 adrenergic receptor
Ligand
BDBM25761
Substrate
Meas. Tech.
ChEBML_56503
IC50
18±n/a nM
Citation
 Lis, RMorgan, TKMarisca, AJGomez, RPLind, JMDavey, DDPhillips, GBSullivan, ME Synthesis of novel (aryloxy)propanolamines and related compounds possessing both class II and class III antiarrhythmic activity. J Med Chem 33:2883-91 (1990)  
Target
Name:
Beta-1 adrenergic receptor
Synonyms:
ADRB1 ADRB1_HUMAN Beta-1 adrenoceptor | adrenergic Beta1
Type:
G Protein-Coupled Receptor (GPCR)
Mol. Mass.:
51338.40
Organism:
Homo sapiens (Human)
Description:
P08588
Residue:
477
  
Inhibitor
Name:
BDBM25761
Synonyms:
Anapriline CHEMBL27 PROPRANOLOL, d PROPRANOLOL,(+) Propanolol Propranolol | [2-hydroxy-3-(naphthalen-1-yloxy)propyl](propan-2-yl)amine
Type:
Small organic molecule
Emp. Form.:
C16H21NO2
Mol. Mass.:
259.3434
SMILES:
CC(C)NCC(O)COc1cccc2ccccc12
: