Target
3-hydroxy-3-methylglutaryl-coenzyme A reductase
Ligand
BDBM50007303
Substrate
Meas. Tech.
ChEBML_78556
IC50
1.8±n/a nM
Citation
 Jendralla, HGranzer, Evon Kerekjarto, BKrause, RSchacht, UBaader, EBartmann, WBeck, GBergmann, AKesseler, K Synthesis and biological activity of new HMG-CoA reductase inhibitors. 3. Lactones of 6-phenoxy-3,5-dihydroxyhexanoic acids. J Med Chem 34:2962-83 (1991)  
Target
Name:
3-hydroxy-3-methylglutaryl-coenzyme A reductase
Synonyms:
3-hydroxy-3-methylglutaryl-coenzyme A (HMG-CoA) reductase HMDH_HUMAN HMG-CoA reductase (HMGR) | HMGCR
Type:
Enzyme
Mol. Mass.:
97477.10
Organism:
Homo sapiens (Human)
Description:
P04035
Residue:
888
  
Inhibitor
Name:
BDBM50007303
Synonyms:
6-(4'-Fluoro-3,5-diisopropyl-biphenyl-2-yloxymethyl)-4-hydroxy-tetrahydro-pyran-2-one | CHEMBL318707
Type:
Small organic molecule
Emp. Form.:
C24H29FO4
Mol. Mass.:
400.4831
SMILES:
CC(C)c1cc(C(C)C)c(OCC2C[C@@H](O)CC(=O)O2)c(c1)-c1ccc(F)cc1
: