Target
Muscarinic acetylcholine receptor M2
Ligand
BDBM50450592
Substrate
Meas. Tech.
ChEBML_140189
Ki
0.030000±n/a nM
Citation
 Hudkins, RLDeHaven-Hudkins, DLStubbins, JF Muscarinic receptor binding profile of para-substituted caramiphen analogues. J Med Chem 34:2984-9 (1991)  
Target
Name:
Muscarinic acetylcholine receptor M2
Synonyms:
ACM2_RAT Chrm-2 | Chrm2
Type:
Enzyme Catalytic Domain
Mol. Mass.:
51555.53
Organism:
RAT
Description:
P10980
Residue:
466
  
Inhibitor
Name:
BDBM50450592
Synonyms:
CHEMBL558910
Type:
Small organic molecule
Emp. Form.:
C21H23NO3
Mol. Mass.:
337.4122
SMILES:
OC(C(=O)O[C@H]1CN2CCC1CC2)(c1ccccc1)c1ccccc1
: