Target
Aromatase
Ligand
BDBM50240798
Substrate
Meas. Tech.
ChEBML_50722
IC50
410±n/a nM
Citation
 Numazawa, MMutsumi, AHoshi, KOshibe, MIshikawa, EKigawa, H Synthesis and biochemical studies of 16- or 19-substituted androst-4-enes as aromatase inhibitors. J Med Chem 34:2496-504 (1991)  
Target
Name:
Aromatase
Synonyms:
ARO1 CP19A_HUMAN CYP19 CYPXIX Cytochrome P450 19A1 Cytochrome P450-C19 (CYP19) FL cytokine receptor precursor | P-450AROM
Type:
Enzyme
Mol. Mass.:
57888.92
Organism:
Homo sapiens (Human)
Description:
P11511
Residue:
503
  
Inhibitor
Name:
BDBM50240798
Synonyms:
(8R,9S,10R,13S,14S)-4-Hydroxy-10,13-dimethyl-1,6,7,8,9,10,11,12,13,14,15,16-dodecahydro-2H-cyclopenta[a]phenanthrene-3,17-dione CHEMBL132530 | FORMESTANE
Type:
Small organic molecule
Emp. Form.:
C19H26O3
Mol. Mass.:
302.4079
SMILES:
C[C@]12CC[C@H]3[C@@H](CCC4C(=O)C(=O)CC[C@]34C)[C@@H]1CCC2=O
: