Target
D(2) dopamine receptor
Ligand
BDBM50002290
Substrate
Meas. Tech.
ChEBML_58197
IC50
114±n/a nM
Citation
 Gilligan, PJCain, GAChristos, TECook, LDrummond, SJohnson, ALKergaye, AAMcElroy, JFRohrbach, KWSchmidt, WK Novel piperidine sigma receptor ligands as potential antipsychotic drugs. J Med Chem 35:4344-61 (1992)  
Target
Name:
D(2) dopamine receptor
Synonyms:
DOPAMINE D2 Dopamine D2 receptor Drd2
Type:
Enzyme
Mol. Mass.:
50957.64
Organism:
Mus musculus (Mouse)
Description:
P61168
Residue:
444
  
Inhibitor
Name:
BDBM50002290
Synonyms:
1-Benzyl-4-[2-(4-fluoro-phenoxy)-ethyl]-piperidine; hydrochloride;0.2hydrate | CHEMBL540585
Type:
Small organic molecule
Emp. Form.:
C20H24FNO
Mol. Mass.:
313.4091
SMILES:
Fc1ccc(OCCC2CCN(Cc3ccccc3)CC2)cc1
: