Target
Sodium-dependent dopamine transporter
Ligand
BDBM50419747
Substrate
Meas. Tech.
ChEBML_62143
IC50
5180±n/a nM
Citation
 Srivastava, SCrippen, GM Analysis of cocaine receptor site ligand binding by three-dimensional Voronoi site modeling approach. J Med Chem 36:3572-9 (1994)  
Target
Name:
Sodium-dependent dopamine transporter
Synonyms:
DA transporter SC6A3_RAT Sodium-dependent dopamine transporter | Sodium-dependent dopamine transporter (DAT)
Type:
Multi-pass membrane protein
Mol. Mass.:
68749.45
Organism:
Rattus norvegicus (rat)
Description:
P23977
Residue:
619
  
Inhibitor
Name:
BDBM50419747
Synonyms:
CHEMBL1947052
Type:
Small organic molecule
Emp. Form.:
C15H19NO2
Mol. Mass.:
245.3169
SMILES:
CN1[C@H]2CC[C@@H]1C[C@H](C2)OC(=O)c1ccccc1
: