Target
Phosphodiesterase
Ligand
BDBM15296
Substrate
Meas. Tech.
ChEMBL_156456 (CHEMBL764834)
IC50
1000±n/a nM
Citation
 Nomoto, YTakai, HOhno, TNagashima, KYao, KYamada, KKubo, KIchimura, MMihara, AKase, H Studies of cardiotonic agents. 8. Synthesis and biological activities of optically active 6-(4-(benzylamino)-7-quinazolinyl)-4,5-dihydro-5-methyl-3(2H)- pyridazinone (KF15232). J Med Chem 39:297-303 (1996)  
Target
Name:
Phosphodiesterase
Synonyms:
Heart phosphodiesterase | Phosphodiesterase 3B
Type:
PROTEIN
Mol. Mass.:
124301.20
Organism:
Bos taurus
Description:
ChEMBL_156453
Residue:
1115
  
Inhibitor
Name:
BDBM15296
Synonyms:
6-methyl-2-oxo-5-(pyridin-4-yl)-1,2-dihydropyridine-3-carbonitrile CHEMBL189 Primacor US9249139, Milrinone
Type:
Small organic molecule
Emp. Form.:
C12H9N3O
Mol. Mass.:
211.2194
SMILES:
Cc1[nH]c(=O)c(cc1-c1ccncc1)C#N
: