Target
Adenosine receptor A3
Ligand
BDBM50336640
Substrate
Meas. Tech.
ChEMBL_31693 (CHEMBL645775)
Ki
8290±n/a nM
Citation
 van Rhee, AMJiang, JLMelman, NOlah, MEStiles, GLJacobson, KA Interaction of 1,4-dihydropyridine and pyridine derivatives with adenosine receptors: selectivity for A3 receptors. J Med Chem 39:2980-9 (1996)  
Target
Name:
Adenosine receptor A3
Synonyms:
A3 adenosine receptor (hA3) ADORA3 | Adenosine A3 receptor (A3AR)
Type:
G Protein-Coupled Receptor (GPCR)
Mol. Mass.:
36197.32
Organism:
Homo sapiens (Human)
Description:
P0DMS8
Residue:
318
  
Inhibitor
Name:
BDBM50336640
Synonyms:
(nifedipine) 2,6-Dimethyl-4-(2-nitro-phenyl)-1,4-dihydro-pyridine-3,5-dicarboxylic acid dimethyl ester Adalat Afeditab cr NIFEDIPINE Procardia dimethyl 2,6-dimethyl-4-(2-nitrophenyl)-1,4-dihydropyridine-3,5-dicarboxylate
Type:
Small organic molecule
Emp. Form.:
C17H18N2O6
Mol. Mass.:
346.3346
SMILES:
COC(=O)C1C(C(C(=O)OC)=C(C)N=C1C)c1ccccc1[N+]([O-])=O
: