Target
D(2) dopamine receptor
Ligand
BDBM50054071
Substrate
Meas. Tech.
ChEMBL_61782 (CHEMBL670536)
Ki
90±n/a nM
Citation
 van Vliet, LATepper, PGDijkstra, DDamsma, GWikström, HPugsley, TAAkunne, HCHeffner, TGGlase, SAWise, LD Affinity for dopamine D2, D3, and D4 receptors of 2-aminotetralins. Relevance of D2 agonist binding for determination of receptor subtype selectivity. J Med Chem 39:4233-7 (1996)  
Target
Name:
D(2) dopamine receptor
Synonyms:
D(2) dopamine receptor DOPAMINE D2 Long DRD2 Dopamine D2 receptor Dopamine D2 receptor (D2R) Dopamine2-like | d2
Type:
Cell-surface receptors
Mol. Mass.:
50647.10
Organism:
Homo sapiens (Human)
Description:
P14416
Residue:
443
  
Inhibitor
Name:
BDBM50054071
Synonyms:
(R)-6-Dipropylamino-5,6,7,8-tetrahydro-naphthalen-1-ol 6-Dipropylamino-5,6,7,8-tetrahydro-naphthalen-1-ol | CHEMBL15146
Type:
Small organic molecule
Emp. Form.:
C16H25NO
Mol. Mass.:
247.3758
SMILES:
CCCN(CCC)[C@@H]1CCc2c(O)cccc2C1
: