Target
Alpha-1B adrenergic receptor
Ligand
BDBM50057453
Substrate
Meas. Tech.
ChEMBL_34631 (CHEMBL647276)
IC50
39±n/a nM
Citation
 Kenny, BBallard, SBlagg, JFox, D Pharmacological options in the treatment of benign prostatic hyperplasia. J Med Chem 40:1293-315 (1997)  
Target
Name:
Alpha-1B adrenergic receptor
Synonyms:
ADA1B_RAT Alpha 1B-adrenoceptor Alpha adrenergic receptor 1A and 1B Alpha-1Adrenoceptor Alpha-1B adrenoreceptor | adrenergic Alpha1B
Type:
G Protein-Coupled Receptor (GPCR)
Mol. Mass.:
56606.71
Organism:
Rattus norvegicus (rat)
Description:
Receptor binding assays were performed using rat cortical membranes.
Residue:
515
  
Inhibitor
Name:
BDBM50057453
Synonyms:
8-{4-[4-(2-Methoxy-phenyl)-piperazin-1-yl]-butoxy}-3-methyl-2-phenyl-chromen-4-one | CHEMBL24629
Type:
Small organic molecule
Emp. Form.:
C31H34N2O4
Mol. Mass.:
498.6127
SMILES:
COc1ccccc1N1CCN(CCCCOc2cccc3c2oc(-c2ccccc2)c(C)c3=O)CC1
: