Target
DNA polymerase subunit gamma-1
Ligand
BDBM50408427
Substrate
Meas. Tech.
ChEMBL_50635 (CHEMBL658102)
IC50
>50000±n/a nM
Citation
 von Janta-Lipinski, MCostisella, BOchs, HHübscher, UHafkemeyer, PMatthes, E Newly synthesized L-enantiomers of 3'-fluoro-modified beta-2'-deoxyribonucleoside 5'-triphosphates inhibit hepatitis B DNA polymerases but not the five cellular DNA polymerases alpha, beta, gamma, delta, and epsilon nor HIV-1 reverse transcriptase. J Med Chem 41:2040-6 (1998)  
Target
Name:
DNA polymerase subunit gamma-1
Synonyms:
DNA Polymerase gamma DNA polymerase (alpha/delta/epsilon) DNA polymerase delta subunit 1 DNA polymerase gamma subunit 1 DNA polymerase kappa DNA polymerase subunit gamma-1 DPOG1_HUMAN Mitochondrial DNA polymerase catalytic subunit POLG1 PolG-alpha
Type:
Enzyme Subunit
Mol. Mass.:
139566.98
Organism:
Homo sapiens (Human)
Description:
Enzyme was purchased from Ulrich Hubscher, University of Zurich-Irchel, Switzerland.
Residue:
1239
  
Inhibitor
Name:
BDBM50408427
Synonyms:
CHEMBL483492
Type:
Small organic molecule
Emp. Form.:
C10H17FN3O12P3
Mol. Mass.:
483.1746
SMILES:
Cc1cn([C@@H]2C[C@@H](F)[C@H](COP(O)(=O)OP(O)(=O)OP(O)(O)=O)O2)c(=O)nc1N
: