Target
DNA polymerase beta
Ligand
BDBM50408428
Substrate
Meas. Tech.
ChEMBL_50632 (CHEMBL658099)
IC50
>100000±n/a nM
Citation
 von Janta-Lipinski, MCostisella, BOchs, HHübscher, UHafkemeyer, PMatthes, E Newly synthesized L-enantiomers of 3'-fluoro-modified beta-2'-deoxyribonucleoside 5'-triphosphates inhibit hepatitis B DNA polymerases but not the five cellular DNA polymerases alpha, beta, gamma, delta, and epsilon nor HIV-1 reverse transcriptase. J Med Chem 41:2040-6 (1998)  
Target
Name:
DNA polymerase beta
Synonyms:
DNA polymerase beta (Pol β) POLB
Type:
Protein
Mol. Mass.:
38188.76
Organism:
Homo sapiens (Human)
Description:
Residue:
335
  
Inhibitor
Name:
BDBM50408428
Synonyms:
CHEMBL2092834
Type:
Small organic molecule
Emp. Form.:
C9H14FN2O13P3
Mol. Mass.:
470.1327
SMILES:
OP(O)(=O)OP(O)(=O)OP(O)(=O)OC[C@@H]1O[C@@H](C[C@H]1F)n1ccc(=O)[nH]c1=O
: