Target
Lysosomal alpha-glucosidase
Ligand
BDBM50259956
Substrate
Meas. Tech.
ChEMBL_34420 (CHEMBL649424)
IC50
340±n/a nM
Citation
 Asano, NNishida, MKato, AKizu, HMatsui, KShimada, YItoh, TBaba, MWatson, AANash, RJLilley, PMWatkin, DJFleet, GW Homonojirimycin isomers and N-alkylated homonojirimycins: structural and conformational basis of inhibition of glycosidases. J Med Chem 41:2565-71 (1998)  
Target
Name:
Lysosomal alpha-glucosidase
Synonyms:
Acidic alpha-glucosidase LYAG_RAT
Type:
PROTEIN
Mol. Mass.:
106191.24
Organism:
Rattus norvegicus
Description:
ChEMBL_1506157
Residue:
953
  
Inhibitor
Name:
BDBM50259956
Synonyms:
2,6-Bis-hydroxymethyl-piperidine-3,4,5-triol US9181184, 34 | alpha-homonojirimycin
Type:
Small organic molecule
Emp. Form.:
C7H15NO5
Mol. Mass.:
193.1977
SMILES:
OC[C@H]1N[C@H](CO)[C@H](O)[C@@H](O)[C@@H]1O
: