Target
Gonadotropin-releasing hormone receptor
Ligand
BDBM50369395
Substrate
Meas. Tech.
ChEMBL_100141 (CHEMBL712499)
IC50
0.50±n/a nM
Citation
 Cho, NHarada, MImaeda, TImada, TMatsumoto, HHayase, YSasaki, SFuruya, SSuzuki, NOkubo, SOgi, KEndo, SOnda, HFujino, M Discovery of a novel, potent, and orally active nonpeptide antagonist of the human luteinizing hormone-releasing hormone (LHRH) receptor. J Med Chem 41:4190-5 (1998)  
Target
Name:
Gonadotropin-releasing hormone receptor
Synonyms:
GNRHR_RAT GnRH-R | Gnrhr
Type:
PROTEIN
Mol. Mass.:
37767.60
Organism:
Rattus norvegicus
Description:
ChEMBL_1335047
Residue:
327
  
Inhibitor
Name:
BDBM50369395
Synonyms:
ELIGARD | LEUPROLIDE
Type:
Small organic molecule
Emp. Form.:
C59H84N16O12
Mol. Mass.:
1209.3983
SMILES:
CCNC(=O)[C@@H]1CCCN1C(=O)[C@H](CCCNC(N)=N)NC(=O)[C@H](CC(C)C)NC(=O)[C@@H](CC(C)C)NC(=O)[C@H](Cc1ccc(O)cc1)NC(=O)[C@H](CO)NC(=O)[C@H](Cc1c[nH]c2ccccc12)NC(=O)[C@H](Cc1cnc[nH]1)NC(=O)[C@@H]1CCC(=O)N1
: