Target
Progesterone receptor
Ligand
BDBM50062427
Substrate
Meas. Tech.
ChEMBL_159558 (CHEMBL765846)
Ki
0.370000±n/a nM
Citation
 Edwards, JPWest, SJMarschke, KBMais, DEGottardis, MMJones, TK 5-Aryl-1,2-dihydro-5H-chromeno[3,4-f]quinolines as potent, orally active, nonsteroidal progesterone receptor agonists: the effect of D-ring substituents. J Med Chem 41:303-10 (1998)  
Target
Name:
Progesterone receptor
Synonyms:
NR3C3 PGR PRGR_HUMAN | progesterone
Type:
Protein
Mol. Mass.:
98979.52
Organism:
Homo sapiens (Human)
Description:
P06401
Residue:
933
  
Inhibitor
Name:
BDBM50062427
Synonyms:
9-Fluoro-2,2,4-trimethyl-5-m-tolyl-2,5-dihydro-1H-6-oxa-1-aza-chrysene | CHEMBL320164
Type:
Small organic molecule
Emp. Form.:
C26H24FNO
Mol. Mass.:
385.4733
SMILES:
CC1=CC(C)(C)Nc2ccc3-c4cc(F)ccc4OC(c4cccc(C)c4)c3c12
: