Target
Adenosine receptor A1
Ligand
BDBM50088422
Substrate
Meas. Tech.
ChEMBL_29487 (CHEMBL641721)
Ki
20±n/a nM
Citation
 Jacobson, KAJi, XLi, AHMelman, NSiddiqui, MAShin, KJMarquez, VERavi, RG Methanocarba analogues of purine nucleosides as potent and selective adenosine receptor agonists. J Med Chem 43:2196-203 (2000)  
Target
Name:
Adenosine receptor A1
Synonyms:
AA1R_RAT ADENOSINE A1 high Adenosine A1 receptor (A1) Adenosine receptors A1 | Adora1
Type:
Protein
Mol. Mass.:
36704.13
Organism:
Rattus norvegicus (rat)
Description:
Residue:
326
  
Inhibitor
Name:
BDBM50088422
Synonyms:
(2R,3R,4S,5R)-2-(6-(3-iodobenzylamino)-9H-purin-9-yl)-5-(hydroxymethyl)-tetrahydrofuran-3,4-diol 2-Hydroxymethyl-5-[6-(3-iodo-benzylamino)-purin-9-yl]-tetrahydro-furan-3,4-diol | CHEMBL66393
Type:
Small organic molecule
Emp. Form.:
C17H18IN5O4
Mol. Mass.:
483.2604
SMILES:
OC[C@H]1O[C@H]([C@H](O)[C@@H]1O)n1cnc2c(NCc3cccc(I)c3)ncnc12
: