Target
Adenosine receptor A3
Ligand
BDBM50088423
Substrate
Meas. Tech.
ChEMBL_32016 (CHEMBL649052)
Ki
466±n/a nM
Citation
 Jacobson, KAJi, XLi, AHMelman, NSiddiqui, MAShin, KJMarquez, VERavi, RG Methanocarba analogues of purine nucleosides as potent and selective adenosine receptor agonists. J Med Chem 43:2196-203 (2000)  
Target
Name:
Adenosine receptor A3
Synonyms:
A3 adenosine receptor (hA3) ADORA3 | Adenosine A3 receptor (A3AR)
Type:
G Protein-Coupled Receptor (GPCR)
Mol. Mass.:
36197.32
Organism:
Homo sapiens (Human)
Description:
P0DMS8
Residue:
318
  
Inhibitor
Name:
BDBM50088423
Synonyms:
(1R,2R,3S,4R,5S)-4-(2-Chloro-6-cyclopentylamino-purin-9-yl)-1-hydroxymethyl-bicyclo[3.1.0]hexane-2,3-diol CHEMBL284216
Type:
Small organic molecule
Emp. Form.:
C17H22ClN5O3
Mol. Mass.:
379.841
SMILES:
OC[C@@]12C[C@@H]1[C@H]([C@H](O)[C@@H]2O)n1cnc2c(NC3CCCC3)nc(Cl)nc12
: