Target
Phosphodiesterase
Ligand
BDBM14363
Substrate
Meas. Tech.
ChEMBL_156623 (CHEMBL759868)
IC50
>100000±n/a nM
Citation
 Watanabe, NAdachi, HTakase, YOzaki, HMatsukura, MMiyazaki, KIshibashi, KIshihara, HKodama, KNishino, MKakiki, MKabasawa, Y 4-(3-Chloro-4-methoxybenzyl)aminophthalazines: synthesis and inhibitory activity toward phosphodiesterase 5. J Med Chem 43:2523-9 (2000)  
Target
Name:
Phosphodiesterase
Synonyms:
Phosphodiesterase 3A
Type:
PROTEIN
Mol. Mass.:
108833.33
Organism:
Sus scrofa
Description:
ChEMBL_155977
Residue:
985
  
Inhibitor
Name:
BDBM14363
Synonyms:
3-(2-propoxyphenyl)-2,4,7,8,9-pentazabicyclo[4.3.0]nona-1,3,6-trien-5-one Tocris-0947 | Zaprinast
Type:
Small organic molecule
Emp. Form.:
C13H13N5O2
Mol. Mass.:
271.2746
SMILES:
CCCOc1ccccc1-c1nc2nn[nH]c2c(=O)[nH]1
: