Target
Metabotropic glutamate receptor 3
Ligand
BDBM50089895
Substrate
Meas. Tech.
ChEMBL_106383 (CHEMBL717238)
Ki
100±n/a nM
Citation
 Bräuner-Osborne, HEgebjerg, JNielsen, EOMadsen, UKrogsgaard-Larsen, P Ligands for glutamate receptors: design and therapeutic prospects. J Med Chem 43:2609-45 (2000)  
Target
Name:
Metabotropic glutamate receptor 3
Synonyms:
GPRC1C GRM3_HUMAN metabotropic glutamate 3 metabotropic glutamate 3/1c
Type:
Enzyme Catalytic Domain
Mol. Mass.:
98889.09
Organism:
Homo sapiens (Human)
Description:
metabotropic glutamate 1c 0 HUMAN::Q14832
Residue:
879
  
Inhibitor
Name:
BDBM50089895
Synonyms:
2-Amino-3-hydroxy-bicyclo[3.1.0]hexane-2,6-dicarboxylic acid(HYDIA) | CHEMBL330097
Type:
Small organic molecule
Emp. Form.:
C8H11NO5
Mol. Mass.:
201.1766
SMILES:
N[C@@]1(C2C(C[C@H]1O)[C@@H]2C(O)=O)C(O)=O
: