Target
Integrin alpha-IIb/beta-3
Ligand
BDBM50092098
Substrate
Meas. Tech.
ChEMBL_219986 (CHEMBL841608)
IC50
140±n/a nM
Citation
 Scarborough, RMGretler, DD Platelet glycoprotein IIb-IIIa antagonists as prototypical integrin blockers: novel parenteral and potential oral antithrombotic agents. J Med Chem 43:3453-73 (2000)  
Target
Name:
Integrin alpha-IIb/beta-3
Synonyms:
Glycoprotein IIb/IIIa
Type:
Mol. Mass.:
Description:
ASSAY_ID of EBI is 30109
Components:
This complex has 2 components.
Component 1
Name:
Integrin beta-3
Synonyms:
CD_antigen=CD61 GPIIIa ITGB3 Platelet membrane glycoprotein IIIa
Type:
Protein
Mol. Mass.:
87038.91
Organism:
Homo sapiens (Human)
Description:
P05106
Residue:
788
  
Component 2
Name:
Integrin alpha-IIb
Synonyms:
CD_antigen=CD41 GPIIb Glycoprotein IIb ITGA2B Integrin alpha-IIb heavy chain Integrin alpha-IIb light chain, form 2 Integrin alpha-V/beta-3 and alpha-IIb/beta 3 | Platelet membrane glycoprotein IIb
Type:
Protein
Mol. Mass.:
113354.85
Organism:
Homo sapiens (Human)
Description:
P08514
Residue:
1039
  
Inhibitor
Name:
BDBM50092098
Synonyms:
CHEMBL1174 Integrilin | [22-Carbamoyl-14-(4-guanidino-butyl)-5-(1H-indol-3-ylmethyl)-4,7,10,13,16,24-hexaoxo-docosahydro-19,20-dithia-3a,6,9,12,15,23-hexaaza-cyclopentacyclotricosen-8-yl]-acetic acid (C68-22, eptifibatide)
Type:
Small organic molecule
Emp. Form.:
C35H49N11O9S2
Mol. Mass.:
831.962
SMILES:
NC(=N)NCCCC[C@@H]1NC(=O)CCSSC[C@H](NC(=O)[C@@H]2CCCN2C(=O)[C@H](Cc2c[nH]c3ccccc23)NC(=O)[C@H](CC(O)=O)NC(=O)CNC1=O)C(N)=O
: