Target
Aminopeptidase N
Ligand
BDBM50087088
Substrate
Meas. Tech.
ChEMBL_28885 (CHEMBL646583)
Ki
5.2±n/a nM
Citation
 Chen, HNoble, FMothé, AMeudal, HCoric, PDanascimento, SRoques, BPGeorge, PFournié-Zaluski, MC Phosphinic derivatives as new dual enkephalin-degrading enzyme inhibitors: synthesis, biological properties, and antinociceptive activities. J Med Chem 43:1398-408 (2001)  
Target
Name:
Aminopeptidase N
Synonyms:
AMPN_PIG AP-M Alanyl aminopeptidase Aminopeptidase N (APN) Microsomal aminopeptidase pAPN
Type:
Protein
Mol. Mass.:
108810.25
Organism:
Sus scrofa (Pig)
Description:
P15145
Residue:
963
  
Inhibitor
Name:
BDBM50087088
Synonyms:
(2S)-2-[(2S)-3-[(1-azaniumylethyl)(hydroxy)phosphoryl]-2-[(4-phenylphenyl)methyl]propanamido]propanoic acid | 1-{[3-Biphenyl-4-yl-2-(1-carboxy-ethylcarbamoyl)-propyl]-hydroxy-phosphinoyl}-ethyl-ammonium
Type:
Small organic molecule
Emp. Form.:
C21H28N2O5P
Mol. Mass.:
419.4306
SMILES:
CC([NH3+])P(O)(=O)C[C@@H](Cc1ccc(cc1)-c1ccccc1)C(=O)N[C@@H](C)C(O)=O
: