Target
Sodium-dependent dopamine transporter
Ligand
BDBM50102577
Substrate
Meas. Tech.
ChEMBL_61359 (CHEMBL673261)
IC50
1.1±n/a nM
Citation
 Meltzer, PCWang, BChen, ZBlundell, PJayaraman, MGonzalez, MDGeorge, CMadras, BK Synthesis of 6- and 7- hydroxy-8-azabicyclo[3.2.1]octanes and their binding affinity for the dopamine and serotonin transporters. J Med Chem 44:2619-35 (2001)  
Target
Name:
Sodium-dependent dopamine transporter
Synonyms:
DA transporter DAT1 Dopamine transporter protein (DAT) SC6A3_HUMAN Sodium-dependent dopamine transporter Solute carrier family 6 member 3
Type:
Multi-pass membrane protein
Mol. Mass.:
68497.11
Organism:
Homo sapiens (Human)
Description:
Q01959
Residue:
620
  
Inhibitor
Name:
BDBM50102577
Synonyms:
3-(3,4-Dichloro-phenyl)-7-hydroxy-8-methyl-8-aza-bicyclo[3.2.1]octane-2-carboxylic acid ethyl ester | CHEMBL86590
Type:
Small organic molecule
Emp. Form.:
C17H21Cl2NO3
Mol. Mass.:
358.26
SMILES:
CCOC(=O)C1C2[C@H](O)CC(CC1c1ccc(Cl)c(Cl)c1)N2C
: