Target
Glycogen phosphorylase, brain form
Ligand
BDBM50240802
Substrate
Meas. Tech.
ChEMBL_138356 (CHEMBL749044)
Ki
32000±n/a nM
Citation
 Somsák, LKovács, LTóth, MOsz, ESzilágyi, LGyörgydeák, ZDinya, ZDocsa, TTóth, BGergely, P Synthesis of and a comparative study on the inhibition of muscle and liver glycogen phosphorylases by epimeric pairs of d-gluco- and d-xylopyranosylidene-spiro-(thio)hydantoins and N-(d-glucopyranosyl) amides. J Med Chem 44:2843-8 (2001)  
Target
Name:
Glycogen phosphorylase, brain form
Synonyms:
Brain glycogen phosphorylase PYGB | PYGB_HUMAN
Type:
PROTEIN
Mol. Mass.:
96699.35
Organism:
Homo sapiens (Human)
Description:
ChEMBL_70998
Residue:
843
  
Inhibitor
Name:
BDBM50240802
Synonyms:
1-N-ACETYL-BETA-D-GLUCOSAMINE N-((2R,3R,4S,5S,6R)-3,4,5-trihydroxy-6-(hydroxymethyl)tetrahydro-2H-pyran-2-yl)acetamide N-acetyl-b-D-glucopyranosylamine | N-acetyl-beta-D-glucopyranosylamine
Type:
Small organic molecule
Emp. Form.:
C8H15NO6
Mol. Mass.:
221.2078
SMILES:
CC(=O)N[C@@H]1O[C@H](CO)[C@@H](O)[C@H](O)[C@H]1O
: