Target
P2X purinoceptor 3
Ligand
BDBM50118222
Substrate
Meas. Tech.
ChEMBL_147401 (CHEMBL751809)
EC50
22±n/a nM
Citation
 Jacobson, KAJarvis, MFWilliams, M Purine and pyrimidine (P2) receptors as drug targets. J Med Chem 45:4057-93 (2002)  
Target
Name:
P2X purinoceptor 3
Synonyms:
ATP receptor P2X purinoceptor 3 P2rx3 ratp2x3 | ratp2x3 + rsa
Type:
Enzyme Catalytic Domain
Mol. Mass.:
44397.63
Organism:
RAT
Description:
Purinergic, P2X3 0 RAT::P49654
Residue:
397
  
Inhibitor
Name:
BDBM50118222
Synonyms:
MRS 2257
Type:
Small organic molecule
Emp. Form.:
C16H18N3O12P3
Mol. Mass.:
537.2494
SMILES:
Cc1nc(N=Nc2cc(CP(O)([O-])=O)cc(CP(O)([O-])=O)c2)c(COP(O)(O)=O)c(C=O)c1O
: