Target
Beta-lactamase
Ligand
BDBM26139
Substrate
Meas. Tech.
ChEMBL_216015 (CHEMBL820516)
IC50
200±n/a nM
Citation
 McGovern, SLCaselli, EGrigorieff, NShoichet, BK A common mechanism underlying promiscuous inhibitors from virtual and high-throughput screening. J Med Chem 45:1712-22 (2002)  
Target
Name:
Beta-lactamase
Synonyms:
AMPC_ECOLI Beta-lactamase (AmpC) Cephalosporinase ampA | ampC
Type:
Protien
Mol. Mass.:
41561.62
Organism:
Escherichia coli
Description:
P00811
Residue:
377
  
Inhibitor
Name:
BDBM26139
Synonyms:
1-benzothiophen-2-ylboranediol CHEMBL34964 | Phenylboronic acid, 11
Type:
Emp. Form.:
C8H7BO2S
Mol. Mass.:
178.016
SMILES:
OB(O)c1cc2ccccc2s1
: