Target
Sodium-dependent serotonin transporter
Ligand
BDBM50111036
Substrate
Meas. Tech.
ChEMBL_198048 (CHEMBL805175)
Ki
0.06±n/a nM
Citation
 Zhang, AZhou, GHoepping, AMukhopadhyaya, JJohnson, KMZhang, MKozikowski, AP Further studies on conformationally constrained tricyclic tropane analogues and their uptake inhibition at monoamine transporter sites: synthesis of (Z)-9-(substituted arylmethylene)-7-azatricyclo[4.3.1.0(3,7)]decanes as a novel class of serotonin transporter inhibitors. J Med Chem 45:1930-41 (2002)  
Target
Name:
Sodium-dependent serotonin transporter
Synonyms:
5-HT Transporter 5HT transporter Anandamid membrane transporter, AMT Monoamine transporters; Norepinephrine & serotonin Slc6a4 Sodium-dependent serotonin transporter (SERT) | imipramine receptor
Type:
Multi-pass membrane protein
Mol. Mass.:
70168.43
Organism:
Rattus norvegicus (rat)
Description:
P31652
Residue:
630
  
Inhibitor
Name:
BDBM50111036
Synonyms:
Benzoic acid 9-(3-chloro-4-iodo-benzylidene)-7-aza-tricyclo[4.3.1.0*3,7*]dec-2-ylmethyl ester CHEMBL58858
Type:
Small organic molecule
Emp. Form.:
C24H23ClINO2
Mol. Mass.:
519.802
SMILES:
Clc1cc(\C=C2/CN3C4CCC3C(COC(=O)c3ccccc3)C2C4)ccc1I
: