Target
Acetylcholinesterase
Ligand
BDBM50369748
Substrate
Meas. Tech.
ChEMBL_28748 (CHEMBL641012)
Ki
0.026±n/a nM
Citation
 Savini, LGaeta, AFattorusso, CCatalanotti, BCampiani, GChiasserini, LPellerano, CNovellino, EMcKissic, DSaxena, A Specific targeting of acetylcholinesterase and butyrylcholinesterase recognition sites. Rational design of novel, selective, and highly potent cholinesterase inhibitors. J Med Chem 46:1-4 (2002)  
Target
Name:
Acetylcholinesterase
Synonyms:
ACES_HUMAN Acetylcholinesterase (AChE) | Acetylcholinesterase (human AChE)
Type:
Enzyme
Mol. Mass.:
67792.70
Organism:
Homo sapiens (Human)
Description:
P22303
Residue:
614
  
Inhibitor
Name:
BDBM50369748
Synonyms:
CHEMBL208599
Type:
Small organic molecule
Emp. Form.:
C18H19ClN2
Mol. Mass.:
298.81
SMILES:
CCC1=CC2C[C@H](C1)c1c(C2)nc2cc(Cl)ccc2c1N
: