Target
Cytochrome P450 2D26
Ligand
BDBM50122613
Substrate
Meas. Tech.
ChEMBL_51710 (CHEMBL665725)
IC50
107000±n/a nM
Citation
 Venhorst, Jter Laak, AMCommandeur, JNFunae, YHiroi, TVermeulen, NP Homology modeling of rat and human cytochrome P450 2D (CYP2D) isoforms and computational rationalization of experimental ligand-binding specificities. J Med Chem 46:74-86 (2002)  
Target
Name:
Cytochrome P450 2D26
Synonyms:
CP2DQ_RAT Cyp2d-26 Cyp2d26 Cytochrome P450 2D26 P450-CMF2 | P450-DB2
Type:
PROTEIN
Mol. Mass.:
56689.75
Organism:
Rattus norvegicus
Description:
ChEMBL_51710
Residue:
500
  
Inhibitor
Name:
BDBM50122613
Synonyms:
3,4-dihydroisoquinoline-2(1H)-carboximidamide Debrisochinum Isocaramidine
Type:
Small organic molecule
Emp. Form.:
C10H13N3
Mol. Mass.:
175.2303
SMILES:
NC(=N)N1CCc2ccccc2C1
: