Target
Cytochrome P450 2D26
Ligand
BDBM50240908
Substrate
Meas. Tech.
ChEMBL_51710 (CHEMBL665725)
IC50
45400±n/a nM
Citation
 Venhorst, Jter Laak, AMCommandeur, JNFunae, YHiroi, TVermeulen, NP Homology modeling of rat and human cytochrome P450 2D (CYP2D) isoforms and computational rationalization of experimental ligand-binding specificities. J Med Chem 46:74-86 (2002)  
Target
Name:
Cytochrome P450 2D26
Synonyms:
CP2DQ_RAT Cyp2d-26 Cyp2d26 Cytochrome P450 2D26 P450-CMF2 | P450-DB2
Type:
PROTEIN
Mol. Mass.:
56689.75
Organism:
Rattus norvegicus
Description:
ChEMBL_51710
Residue:
500
  
Inhibitor
Name:
BDBM50240908
Synonyms:
CHEMBL170988 N''-{amino[(2-phenylethyl)imino]methyl}guanidine N-(2-phenylethyl)imidodicarbonimidic diamide(Phenformin) PHENFORMIN
Type:
Small organic molecule
Emp. Form.:
C10H15N5
Mol. Mass.:
205.2596
SMILES:
NC(=N)N=C(N)NCCc1ccccc1
: