Target
Alpha-1B adrenergic receptor
Ligand
BDBM50026917
Substrate
Meas. Tech.
ChEMBL_34333 (CHEMBL648993)
Ki
631±n/a nM
Citation
 Romeo, GMateria, LManetti, FCagnotto, AMennini, TNicoletti, FBotta, MRusso, FMinneman, KP New pyrimido[5,4-b]indoles as ligands for alpha(1)-adrenoceptor subtypes. J Med Chem 46:2877-94 (2003)  
Target
Name:
Alpha-1B adrenergic receptor
Synonyms:
ADA1B_HUMAN Adrenergic alpha1B Adrenergic receptor alpha Alpha 1B-adrenoreceptor | Alpha-1B adrenergic receptor
Type:
Enzyme
Mol. Mass.:
56862.13
Organism:
Homo sapiens (Human)
Description:
P35368
Residue:
520
  
Inhibitor
Name:
BDBM50026917
Synonyms:
8-(2-(4-(2-methoxyphenyl)piperazin-1-yl)ethyl)-8-azaspiro[4.5]decane-7,9-dione 8-{2-[4-(2-Methoxy-phenyl)-piperazin-1-yl]-ethyl}-8-aza-spiro[4.5]decane-7,9-dione BMY 7378 CHEMBL1256934 CHEMBL543741
Type:
Small organic molecule
Emp. Form.:
C22H31N3O3
Mol. Mass.:
385.4998
SMILES:
COc1ccccc1N1CCN(CCN2C(=O)CC3(CCCC3)CC2=O)CC1
: