Target
5-hydroxytryptamine receptor 2A
Ligand
BDBM50133231
Substrate
Meas. Tech.
ChEMBL_2588 (CHEMBL617456)
IC50
0.4±n/a nM
Citation
 May, JAChen, HHRusinko, ALynch, VMSharif, NAMcLaughlin, MA A novel and selective 5-HT2 receptor agonist with ocular hypotensive activity: (S)-(+)-1-(2-aminopropyl)-8,9-dihydropyrano[3,2-e]indole. J Med Chem 46:4188-95 (2003)  
Target
Name:
5-hydroxytryptamine receptor 2A
Synonyms:
5-HT-2A 5-HT2A 5-hydroxytryptamine receptor 2A (5HT2A) Htr2 Serotonin Receptor 2A
Type:
G Protein-Coupled Receptor (GPCR)
Mol. Mass.:
52852.05
Organism:
Rattus norvegicus (rat)
Description:
Rat cortex membranes 5-HT2A receptors.
Residue:
471
  
Inhibitor
Name:
BDBM50133231
Synonyms:
(R)-1-(4-iodo-2,5-dimethoxyphenyl)propan-2-amine (R)-2-(4-iodo-2,5-dimethoxyphenyl)-1-methylethylamine | CHEMBL134519
Type:
Small organic molecule
Emp. Form.:
C11H16INO2
Mol. Mass.:
321.1547
SMILES:
COc1cc(C[C@@H](C)N)c(OC)cc1I
: