Target
Chymotrypsinogen A
Ligand
BDBM50012957
Substrate
Meas. Tech.
ChEMBL_49921 (CHEMBL664290)
IC50
360000±n/a nM
Citation
 Seidler, JMcGovern, SLDoman, TNShoichet, BK Identification and prediction of promiscuous aggregating inhibitors among known drugs. J Med Chem 46:4477-86 (2003)  
Target
Name:
Chymotrypsinogen A
Synonyms:
Alpha-chymotrypsin Chymotrypsin A Chymotrypsin A chain B Chymotrypsinogen A | alpha-Chymotrypsin (α-Chymotrypsin)
Type:
Serine protease
Mol. Mass.:
25670.88
Organism:
Bos taurus (bovine)
Description:
Residue:
245
  
Inhibitor
Name:
BDBM50012957
Synonyms:
1-((p-(2-(5-chloro-o-anisamido)ethyl)phenyl)sulfonyl)-3-cyclohexylurea 5-chloro-N-(2-(4-((((cyclohexylamino)carbonyl)amino)sulfonyl)phenyl)ethyl)-2-methoxybenzamide CHEMBL472 Glibenclamide | US20230348371, Compound 5
Type:
Small organic molecule
Emp. Form.:
C23H28ClN3O5S
Mol. Mass.:
494.004
SMILES:
COc1ccc(Cl)cc1C(=O)NCCc1ccc(cc1)S(=O)(=O)NC(=O)NC1CCCCC1
: