Target
5-hydroxytryptamine receptor 4
Ligand
BDBM50122873
Substrate
Meas. Tech.
ChEMBL_3329 (CHEMBL619029)
EC50
40.3±n/a nM
Citation
 Langlois, MFischmeister, R 5-HT4 receptor ligands: applications and new prospects. J Med Chem 46:319-44 (2003)  
Target
Name:
5-hydroxytryptamine receptor 4
Synonyms:
5-HT-4 5-HT4L 5-hydroxytryptamine receptor 4 Htr4 Serotonin 4 (5-HT4) receptor
Type:
Enzyme Catalytic Domain
Mol. Mass.:
46117.31
Organism:
RAT
Description:
5-HT4 HTR4 RAT::Q62758
Residue:
406
  
Inhibitor
Name:
BDBM50122873
Synonyms:
3-Isopropyl-2-oxo-2,3-dihydro-benzoimidazole-1-carboxylic acid (9-methyl-9-aza-bicyclo[3.3.1]non-3-yl)-amide | CHEMBL324057
Type:
Small organic molecule
Emp. Form.:
C20H28N4O2
Mol. Mass.:
356.4619
SMILES:
CC(C)n1c2ccccc2n(C(=O)NC2CC3CCCC(C2)N3C)c1=O
: