Target
Cytochrome P450 3A4
Ligand
BDBM46355
Substrate
Meas. Tech.
ChEMBL_52069 (CHEMBL664809)
IC50
>50000±n/a nM
Citation
 Schwab, DFischer, HTabatabaei, APoli, SHuwyler, J Comparison of in vitro P-glycoprotein screening assays: recommendations for their use in drug discovery. J Med Chem 46:1716-25 (2003)  
Target
Name:
Cytochrome P450 3A4
Synonyms:
Albendazole monooxygenase CP3A4_HUMAN CYP3A4 CYPIIIA4 Cytochrome P450 3A4 (CYP3A4) Nifedipine oxidase Taurochenodeoxycholate 6-alpha-hydroxylase
Type:
Enzyme
Mol. Mass.:
57349.57
Organism:
Homo sapiens (Human)
Description:
Residue:
503
  
Inhibitor
Name:
BDBM46355
Synonyms:
DIGOXIN SMR000059217 cid_2724385
Type:
Small organic molecule
Emp. Form.:
C41H64O14
Mol. Mass.:
780.9385
SMILES:
C[C@H]1O[C@H](C[C@H](O)[C@@H]1O)O[C@H]1[C@@H](O)C[C@H](O[C@H]2[C@@H](O)C[C@H](O[C@H]3CC[C@@]4(C)[C@H](CC[C@@H]5[C@@H]4C[C@@H](O)[C@]4(C)[C@H](CC[C@]54O)C4=CC(=O)OC4)C3)O[C@@H]2C)O[C@@H]1C
: