Target
Tyrosine-protein phosphatase non-receptor type 1
Ligand
BDBM50149232
Substrate
Meas. Tech.
ChEMBL_162588 (CHEMBL768529)
Ki
22±n/a nM
Citation
 Erlanson, DAMcDowell, RSO'Brien, T Fragment-based drug discovery. J Med Chem 47:3463-82 (2004)  
Target
Name:
Tyrosine-protein phosphatase non-receptor type 1
Synonyms:
PTN1_HUMAN PTPN1 Protein tyrosine phosphatase-1B (PTP1B) Protein-tyrosine phosphatase 1B (PTP1B) Tyrosine-protein phosphatase non-receptor type 1 (PTP1B)
Type:
Protein phosphatase
Mol. Mass.:
49963.76
Organism:
Homo sapiens (Human)
Description:
Human recombinant GST-fusion PTP1B (1-435).
Residue:
435
  
Inhibitor
Name:
BDBM50149232
Synonyms:
3-(5-(2-acetamido-3-(4-(carboxy-N-(2-carboxyphenyl)formamido))naphthalen-1-yl)propanamido)pentyloxy)-2-naphthoic acid CHEMBL324968
Type:
Small organic molecule
Emp. Form.:
C40H37N3O10
Mol. Mass.:
719.7359
SMILES:
CC(=O)NC(Cc1ccc(N(C(=O)C(O)=O)c2ccccc2C(O)=O)c2ccccc12)C(=O)NCCCCCOc1cc2ccccc2cc1C(O)=O
: