Target
Endothelin-1 receptor
Ligand
BDBM50027796
Substrate
Meas. Tech.
ChEMBL_63504 (CHEMBL676594)
IC50
69000±n/a nM
Citation
 Wermuth, CG Selective optimization of side activities: another way for drug discovery. J Med Chem 47:1303-14 (2004)  
Target
Name:
Endothelin-1 receptor
Synonyms:
EDNRA ET-A ETA-R Endothelin receptor type A hET-AR
Type:
Enzyme Catalytic Domain
Mol. Mass.:
48736.88
Organism:
Homo sapiens (Human)
Description:
P25101
Residue:
427
  
Inhibitor
Name:
BDBM50027796
Synonyms:
2-(Sulfanilylamino)thiazole 2-(p-Aminobenzenesulphonamido)thiazole 2-Sulfanilamidothiazole 4-Amino-N-2-thiazolylbenzenesulfonamide CHEMBL437 Sulfanilamidothiazole Sulphathiazole | cid_5340
Type:
Small organic molecule
Emp. Form.:
C9H9N3O2S2
Mol. Mass.:
255.317
SMILES:
Nc1ccc(cc1)S(=O)(=O)Nc1nccs1
: