Target
Fibroblast growth factor 1
Ligand
BDBM50143025
Substrate
Meas. Tech.
ChEMBL_70628 (CHEMBL678684)
Kd
337500±n/a nM
Citation
 Bytheway, ICochran, S Validation of molecular docking calculations involving FGF-1 and FGF-2. J Med Chem 47:1683-93 (2004)  
Target
Name:
Fibroblast growth factor 1
Synonyms:
Acidic fibroblast growth factor ECGF-beta FGF1_HUMAN Fibroblast growth factor 1 (FGF-1) Heparin-binding growth factor 1 | aFGF
Type:
Protein
Mol. Mass.:
17461.01
Organism:
Homo sapiens (Human)
Description:
P05230
Residue:
155
  
Inhibitor
Name:
BDBM50143025
Synonyms:
3-(benzyloxy)-6-methoxy-2-methyl-5-(sulfonatooxy)tetrahydro-2H-pyran-4-yl sulfate
Type:
Small organic molecule
Emp. Form.:
C14H18O11S2
Mol. Mass.:
426.417
SMILES:
COC1OC(C)C(OCc2ccccc2)C(OS([O-])(=O)=O)C1OS([O-])(=O)=O
: