Target
Beta-1 adrenergic receptor
Ligand
BDBM50027161
Substrate
Meas. Tech.
ChEMBL_310554 (CHEMBL834455)
EC50
2.2±n/a nM
Citation
 Nakajima, YHamashima, HWashizuka, KTomishima, YOhtake, HImamura, EMiura, TKayakiri, HKato, M Discovery of a novel, potent and selective human beta3-adrenergic receptor agonist. Bioorg Med Chem Lett 15:251-4 (2004)  
Target
Name:
Beta-1 adrenergic receptor
Synonyms:
ADRB1 ADRB1_HUMAN Beta-1 adrenoceptor | adrenergic Beta1
Type:
G Protein-Coupled Receptor (GPCR)
Mol. Mass.:
51338.40
Organism:
Homo sapiens (Human)
Description:
P08588
Residue:
477
  
Inhibitor
Name:
BDBM50027161
Synonyms:
CHEMBL183307
Type:
Small organic molecule
Emp. Form.:
C26H31N3O5
Mol. Mass.:
465.5414
SMILES:
COc1ccc(NC(=O)Nc2ccc(C[C@@H](CO)NC[C@H](O)COc3ccccc3)cc2)cc1
: