Target
Histamine H1 receptor
Ligand
BDBM22876
Substrate
Meas. Tech.
ChEMBL_302883 (CHEMBL828797)
Ki
37±n/a nM
Citation
 Janssens, FLeenaerts, JDiels, GDe Boeck, BMegens, ALanglois, Xvan Rossem, KBeetens, JBorgers, M Norpiperidine imidazoazepines as a new class of potent, selective, and nonsedative H1 antihistamines. J Med Chem 48:2154-66 (2005)  
Target
Name:
Histamine H1 receptor
Synonyms:
H1R HISTAMINE H1 HRH1_HUMAN
Type:
G Protein-Coupled Receptor (GPCR)
Mol. Mass.:
55808.72
Organism:
Homo sapiens (Human)
Description:
Cell pellets from SK-N-MC cells transfected with human H1 receptor were used in binding assay.
Residue:
487
  
Inhibitor
Name:
BDBM22876
Synonyms:
CHEMBL998 Loratadine US9138431, LORATADINE (Claritin) ethyl 4-{13-chloro-4-azatricyclo[9.4.0.0^{3,8}]pentadeca-1(11),3(8),4,6,12,14-hexaen-2-ylidene}piperidine-1-carboxylate
Type:
Small organic molecule
Emp. Form.:
C22H23ClN2O2
Mol. Mass.:
382.883
SMILES:
[#6]-[#6]-[#8]-[#6](=O)-[#7]-1-[#6]-[#6]\[#6](-[#6]-[#6]-1)=[#6]-1\c2ccc(Cl)cc2-[#6]-[#6]-c2cccnc-12
: