Target
Prostaglandin G/H synthase 2
Ligand
BDBM22365
Substrate
Meas. Tech.
ChEMBL_321318 (CHEMBL882588)
IC50
3200±n/a nM
Citation
 Rao, PNChen, QHKnaus, EE Synthesis and biological evaluation of 1,3-diphenylprop-2-yn-1-ones as dual inhibitors of cyclooxygenases and lipoxygenases. Bioorg Med Chem Lett 15:4842-5 (2005)  
Target
Name:
Prostaglandin G/H synthase 2
Synonyms:
COX2 Cyclooxygenase-2 (COX-2) PTGS2 Prostaglandin G/H synthase (cyclooxygenase)
Type:
Protein
Mol. Mass.:
68976.98
Organism:
Ovis aries (Sheep)
Description:
Residue:
603
  
Inhibitor
Name:
BDBM22365
Synonyms:
1,3-Diarylprop-2-yn-1-one, 23b CHEMBL196084
Type:
Small organic molecule
Emp. Form.:
C17H14O5S
Mol. Mass.:
330.355
SMILES:
COc1ccc(cc1O)C(=O)C#Cc1ccc(cc1)S(C)(=O)=O
: