Target
Prostaglandin G/H synthase 2
Ligand
BDBM22344
Substrate
Meas. Tech.
ChEMBL_321318 (CHEMBL882588)
IC50
10000±n/a nM
Citation
 Rao, PNChen, QHKnaus, EE Synthesis and biological evaluation of 1,3-diphenylprop-2-yn-1-ones as dual inhibitors of cyclooxygenases and lipoxygenases. Bioorg Med Chem Lett 15:4842-5 (2005)  
Target
Name:
Prostaglandin G/H synthase 2
Synonyms:
COX2 Cyclooxygenase-2 (COX-2) PTGS2 Prostaglandin G/H synthase (cyclooxygenase)
Type:
Protein
Mol. Mass.:
68976.98
Organism:
Ovis aries (Sheep)
Description:
Residue:
603
  
Inhibitor
Name:
BDBM22344
Synonyms:
1,3-Diarylprop-2-yn-1-one, 13a CHEMBL193856
Type:
Small organic molecule
Emp. Form.:
C16H12O3S
Mol. Mass.:
284.33
SMILES:
CS(=O)(=O)c1ccc(cc1)C#CC(=O)c1ccccc1
: