Target
Prostaglandin G/H synthase 1
Ligand
BDBM22356
Substrate
Meas. Tech.
ChEMBL_321312 (CHEMBL881408)
IC50
>100000±n/a nM
Citation
 Rao, PNChen, QHKnaus, EE Synthesis and biological evaluation of 1,3-diphenylprop-2-yn-1-ones as dual inhibitors of cyclooxygenases and lipoxygenases. Bioorg Med Chem Lett 15:4842-5 (2005)  
Target
Name:
Prostaglandin G/H synthase 1
Synonyms:
COX1 Cyclooxygenase-1 (COX-1) PTGS1 | Prostaglandin G/H synthase (cyclooxygenase)
Type:
Protein
Mol. Mass.:
68868.60
Organism:
Ovis aries (Sheep)
Description:
Residue:
600
  
Inhibitor
Name:
BDBM22356
Synonyms:
1,3-Diarylprop-2-yn-1-one, 13m CHEMBL364739
Type:
Small organic molecule
Emp. Form.:
C16H12O4S
Mol. Mass.:
300.329
SMILES:
CS(=O)(=O)c1ccc(cc1)C#CC(=O)c1cccc(O)c1
: